{"text_format":"1","workbook":"xlsx","n_sheets":15,"sheets":["Accueil","Mon_evenement","Mes_objectifs","Actions","Empreinte_Carbone","Planning","Budget","Synthese","Synthese_theme","Fiche","Ton_avis","Glossaire","Credits","Paramètres","Feuil2"],"not_rendered":{"charts":6,"images":75,"macros":1,"external_links":2,"defined_names":48,"comments":1,"pivot_tables":0},"unopened":[],"bounds":{"document_bytes":16777216,"sheet_cells":100000,"rows_first":2000,"rows_last":500,"rows_between":2000,"halvings":0,"cell_chars":16384,"cell_head_chars":4096},"cells_cut":0,"cells_raw":0,"read":"whole","date_system":"1900"}

{"sheet":"Accueil","index":0,"n_rows":0,"n_cols":0,"rows_kept":0,"cut":false,"hidden":false,"merged":[]}

{"sheet":"Mon_evenement","index":1,"n_rows":39,"n_cols":34,"rows_kept":39,"cut":false,"hidden":false,"merged":[[29,15,29,18],[27,4,27,11],[29,5,29,11],[31,6,31,11],[11,26,11,29],[11,21,11,24],[25,4,25,7],[16,31,16,35],[25,33,25,36],[14,15,14,17],[22,14,22,18],[14,2,24,11],[38,28,38,32],[31,32,32,35],[34,4,34,11],[37,17,37,20],[34,25,34,26]]}
[]
[]
[]
[]
[]
[]
[]
[]
[]
[]
{"$rows_left_out":30}
{"sheet":"Mes_objectifs","index":2,"n_rows":41,"n_cols":30,"rows_kept":41,"cut":false,"hidden":false,"merged":[[14,13,14,14],[16,6,16,10],[22,4,22,8],[27,3,27,7],[32,5,32,9],[38,6,38,10],[40,13,40,14],[16,16,16,19],[22,18,22,21],[27,19,27,22],[32,17,32,20],[38,16,38,19]]}
[]
[]
[]
[]
[]
[]
[]
[]
[]
[]
{"$rows_left_out":32}
{"sheet":"Actions","index":3,"n_rows":471,"n_cols":62,"rows_kept":471,"cut":false,"hidden":false,"merged":[[4,49,4,61]]}
[]
[]
[]
[]
[]
["id","THEMES","SOUS-THEMES","CATEGORIES","OBJECTIFS","ACTIONS D'AMELIORATIONS","PRIO",".","CHOIX","RESPONSABLE","ETAT","ACTIONS ENTREPRISES","EXEMPLES ET LIENS","Ancrage territorial","Biodiversité","Culture","Economie","Empreinte carbone","Equité","Gestion des ressources","Gouvernance","Respect des participants","Sécurité","Solidarité","Voisinage","Déplacements","Pas de déplacements","Journée","Soirée","< 1 Jour","Plusieurs jours","Intérieur","Extérieur","Communautaire","Ouvert","Oui","Non","Oui","Oui","Sans alimentation","Nécessite un budget","Aucun budget","Organisateurs","Participants","Compliqué","Simple","Applicable","d","A Garder","AT","B","C","Eco","E C","Eq","G R","G","R P","Secu","Soli","V","TOTAL"]
[3,"ANCRAGE TERRITORIAL","Contextualisation de l'événement","Espace naturel","Etudier l'impact local de l'événement","Faire un diagnostic de l'impact local de l'évènement avant et après sa réalisation.",1,null,null,null,null,null,null,"X",null,null,null,null,null,null,"X",null,null,null,null,"X","X","X","X","X","X","O","X","X","X","X","X","X","X","X",null,null,null,null,null,null,null,null,{"$f":"IF(OR(BJ7=0,AU7=\"Non applicable\"),0,1)","v":0},{"$f":"IF(AND(N7=\"X\",$G7>=AX$471),1,0)","v":0},{"$f":"IF(AND(O7=\"X\",$G7>=AY$471),1,0)","v":0},{"$f":"IF(AND(P7=\"X\",$G7>=AZ$471),1,0)","v":0},{"$f":"IF(AND(Q7=\"X\",$G7>=BA$471),1,0)","v":0},{"$f":"IF(AND(R7=\"X\",$G7>=BB$471),1,0)","v":0},{"$f":"IF(AND(S7=\"X\",$G7>=BC$471),1,0)","v":0},{"$f":"IF(AND(T7=\"X\",$G7>=BD$471),1,0)","v":0},{"$f":"IF(AND(U7=\"X\",$G7>=BE$471),1,0)","v":0},{"$f":"IF(AND(V7=\"X\",$G7>=BF$471),1,0)","v":0},{"$f":"IF(AND(W7=\"X\",$G7>=BG$471),1,0)","v":0},{"$f":"IF(AND(X7=\"X\",$G7>=BH$471),1,0)","v":0},{"$f":"IF(AND(Y7=\"X\",$G7>=BI$471),1,0)","v":0},{"$f":"SUM(AX7:BI7)","v":0}]
[4,"ANCRAGE TERRITORIAL","Contextualisation de l'événement","Lieu de vie/décors","Faire découvrir le cadre local","Privilégier le recrutement d'organisateurs ayant vécu sur le territoire d'accueil de l'évènement.",1,null,null,null,null,null,null,"X",null,null,null,null,null,null,null,null,null,null,null,"X","X","X","X","X","X","X","X","X","X","X","X","X","X","X",null,null,null,null,null,null,null,null,0,0,0,0,0,0,0,0,0,0,0,0,0,0]
[5,"ANCRAGE TERRITORIAL","Contextualisation de l'événement","Lieu de vie/décors","Faire découvrir le cadre local","Inviter les participants à découvrir la région dans laquelle s'organise l'évènement.",1,null,null,null,null,null,null,"X",null,null,null,null,null,null,null,null,null,null,null,"X","X","X","X","O","X","X","X","X","X","X","X","X","X","X",null,null,null,null,null,null,null,null,0,0,0,0,0,0,0,0,0,0,0,0,0,0]
[6,"ANCRAGE TERRITORIAL","Contextualisation de l'événement","Lieu de vie/décors","Faire découvrir le cadre local","Intégrer le cadre local de l'évènement dans la stratégie de communication externe.",1,null,null,null,null,null,null,"X",null,null,null,null,null,null,null,null,null,null,null,"X","X","X","O","O","X","X","X","X","X","X","X","X","X","X",null,null,null,null,null,null,null,null,0,0,0,0,0,0,0,0,0,0,0,0,0,0]
{"$rows_left_out":462}
{"sheet":"Empreinte_Carbone","index":4,"n_rows":313,"n_cols":17,"rows_kept":313,"cut":false,"hidden":false,"merged":[[306,1,306,2],[308,1,308,2],[309,1,309,2],[310,1,310,2],[311,1,311,2],[312,1,312,2],[299,1,299,2],[300,1,300,2],[301,1,301,2],[303,1,303,2],[304,1,304,2],[305,1,305,2],[295,1,295,2],[295,6,295,8],[296,6,296,8],[297,1,297,2],[297,6,297,8],[298,1,298,2],[291,1,291,2],[291,6,291,8],[292,6,292,8],[293,1,293,2],[293,6,293,8],[294,6,294,8],[288,1,288,2],[289,1,289,2],[290,1,290,2],[274,1,275,3],[276,1,276,3],[277,5,277,7],[284,1,284,16],[287,1,287,2],[287,6,287,8],[287,9,287,11],[251,1,251,7],[238,1,245,2],[265,1,265,3],[267,1,267,3],[268,1,268,3],[269,1,269,3],[273,4,273,7],[255,1,255,3],[255,7,256,7],[256,1,256,3],[257,1,257,3],[258,1,258,3],[263,4,264,4],[261,1,261,7],[271,1,271,7],[255,6,256,6],[246,1,246,3],[247,1,247,3],[248,1,248,3],[249,1,249,3],[225,1,225,3],[232,1,232,16],[236,4,237,4],[237,1,237,3],[241,9,242,11],[241,12,242,12],[234,1,234,7],[221,1,222,1],[221,2,221,3],[222,2,222,3],[223,1,224,1],[223,2,223,3],[224,2,224,3],[216,2,216,3],[217,1,217,3],[218,1,220,1],[218,2,218,3],[219,2,219,3],[220,2,220,3],[211,7,211,9],[211,11,211,13],[212,1,212,3],[213,1,215,1],[213,2,213,3],[214,2,214,3],[215,2,215,3],[206,1,206,3],[211,4,211,6],[209,1,209,13],[199,1,201,1],[199,2,199,3],[200,2,200,3],[201,2,201,3],[202,1,203,1],[202,2,202,3],[203,2,203,3],[197,2,197,3],[198,1,198,3],[192,4,192,6],[192,7,192,9],[192,11,192,13],[193,1,193,3],[204,1,205,1],[204,2,204,3],[205,2,205,3],[190,1,190,13],[178,2,178,3],[179,1,179,3],[180,1,182,1],[180,2,180,3],[181,2,181,3],[182,2,182,3],[194,1,196,1],[194,2,194,3],[195,2,195,3],[196,2,196,3],[173,4,173,6],[173,7,173,9],[187,1,187,3],[173,11,173,13],[174,1,174,3],[175,1,177,1],[175,2,175,3],[176,2,176,3],[177,2,177,3],[183,1,184,1],[183,2,183,3],[184,2,184,3],[185,1,186,1],[185,2,185,3],[186,2,186,3],[159,1,159,3],[160,1,160,3],[161,1,161,3],[162,1,162,3],[169,1,169,16],[159,6,162,8],[171,1,171,13],[151,1,151,3],[152,1,152,3],[153,1,153,3],[157,4,158,4],[157,5,158,5],[158,1,158,3],[146,1,146,3],[147,1,148,3],[148,4,149,4],[148,5,149,5],[149,1,149,3],[150,1,150,3],[155,1,155,10],[138,1,138,3],[143,4,144,4],[143,5,144,5],[144,1,144,3],[145,1,145,3],[129,1,129,3],[130,1,130,3],[131,1,131,3],[136,4,137,4],[137,1,137,3],[134,1,134,10],[141,1,141,10],[123,1,124,3],[124,4,125,4],[125,1,125,3],[126,1,126,3],[127,1,127,3],[128,1,128,3],[115,1,115,16],[119,4,120,4],[120,1,120,3],[121,1,121,3],[122,1,122,3],[117,1,117,10],[103,5,104,5],[104,1,104,3],[105,1,105,3],[105,6,108,8],[106,1,106,3],[107,1,107,3],[108,1,108,3],[96,1,96,3],[97,1,97,3],[98,1,98,3],[99,1,99,3],[103,4,104,4],[101,1,101,10],[89,1,89,3],[90,1,90,3],[94,4,95,4],[94,5,95,5],[95,1,95,3],[82,1,82,3],[83,1,83,3],[84,1,84,3],[85,1,85,3],[87,4,88,4],[88,1,88,3],[92,1,92,10],[58,1,58,10],[73,5,74,5],[74,1,74,3],[75,1,75,3],[80,4,81,4],[81,1,81,3],[69,1,71,1],[69,2,69,3],[70,2,70,3],[71,2,71,3],[72,1,73,3],[73,4,74,4],[78,1,78,10],[64,1,64,2],[65,1,65,2],[66,1,67,3],[67,4,68,4],[67,5,68,5],[68,1,68,3],[60,4,61,4],[60,5,61,5],[61,1,61,3],[62,1,62,3],[63,1,63,2],[42,1,42,2],[42,9,44,10],[42,11,44,11],[45,9,45,11],[56,1,56,16],[30,1,30,3],[30,4,30,5],[31,1,31,3],[32,1,32,3],[32,9,38,13],[34,1,34,3],[36,1,36,3],[38,1,38,3],[43,2,44,4],[28,1,28,3],[28,4,28,5],[19,9,19,12],[19,13,19,16],[20,1,20,2],[21,1,21,2],[22,1,22,2],[24,1,24,3],[24,4,24,5],[19,1,19,3],[23,1,23,5],[5,1,5,16],[6,8,6,10],[9,1,9,16],[13,1,13,7],[16,1,16,4],[26,1,26,3],[26,4,26,5],[26,10,26,12],[26,14,26,16],[6,6,6,7],[6,4,6,5],[6,14,6,16],[6,11,6,13],[6,1,6,3],[10,1,10,16],[17,1,18,6]]}
[]
[]
[]
[]
[]
[null,"EMPREINTE CARBONE DE L'EVENEMENT"]
[null,"LIEU-HEBERGEMENT",null,null,"RESTAURATION",null,"MATERIELS",null,"DEPLACEMENT DE PERSONNES",null,null,"COMMUNICATION",null,null,"TOTALISATEUR"]
[]
[]
[null,"LIEU-HEBERGEMENT"]
{"$rows_left_out":304}
{"sheet":"Planning","index":5,"n_rows":100,"n_cols":67,"rows_kept":100,"cut":false,"hidden":false,"merged":[[6,1,8,1],[6,3,6,5],[6,7,6,11],[4,1,4,66]]}
[]
[]
[]
[]
[null,"CALENDRIER"]
[]
[null,"PLANNING",null,"NE PAS REMPLIR",null,null,"Année ","A REMPLIR",null,null,null,null,null,"Mois",1,{"$f":"IF(MONTH(P9)=MONTH(O9),\"\",MAX($O7:O7)+1)","v":""},{"$f":"IF(MONTH(Q9)=MONTH(P9),\"\",MAX($O7:P7)+1)","v":""},{"$f":"IF(MONTH(R9)=MONTH(Q9),\"\",MAX($O7:Q7)+1)","v":""},{"$f":"IF(MONTH(S9)=MONTH(R9),\"\",MAX($O7:R7)+1)","v":""},{"$f":"IF(MONTH(T9)=MONTH(S9),\"\",MAX($O7:S7)+1)","v":2},{"$f":"IF(MONTH(U9)=MONTH(T9),\"\",MAX($O7:T7)+1)","v":""},{"$f":"IF(MONTH(V9)=MONTH(U9),\"\",MAX($O7:U7)+1)","v":""},{"$f":"IF(MONTH(W9)=MONTH(V9),\"\",MAX($O7:V7)+1)","v":""},{"$f":"IF(MONTH(X9)=MONTH(W9),\"\",MAX($O7:W7)+1)","v":3},{"$f":"IF(MONTH(Y9)=MONTH(X9),\"\",MAX($O7:X7)+1)","v":""},{"$f":"IF(MONTH(Z9)=MONTH(Y9),\"\",MAX($O7:Y7)+1)","v":""},{"$f":"IF(MONTH(AA9)=MONTH(Z9),\"\",MAX($O7:Z7)+1)","v":""},{"$f":"IF(MONTH(AB9)=MONTH(AA9),\"\",MAX($O7:AA7)+1)","v":4},{"$f":"IF(MONTH(AC9)=MONTH(AB9),\"\",MAX($O7:AB7)+1)","v":""},{"$f":"IF(MONTH(AD9)=MONTH(AC9),\"\",MAX($O7:AC7)+1)","v":""},{"$f":"IF(MONTH(AE9)=MONTH(AD9),\"\",MAX($O7:AD7)+1)","v":""},{"$f":"IF(MONTH(AF9)=MONTH(AE9),\"\",MAX($O7:AE7)+1)","v":""},{"$f":"IF(MONTH(AG9)=MONTH(AF9),\"\",MAX($O7:AF7)+1)","v":5},{"$f":"IF(MONTH(AH9)=MONTH(AG9),\"\",MAX($O7:AG7)+1)","v":""},{"$f":"IF(MONTH(AI9)=MONTH(AH9),\"\",MAX($O7:AH7)+1)","v":""},{"$f":"IF(MONTH(AJ9)=MONTH(AI9),\"\",MAX($O7:AI7)+1)","v":""},{"$f":"IF(MONTH(AK9)=MONTH(AJ9),\"\",MAX($O7:AJ7)+1)","v":6},{"$f":"IF(MONTH(AL9)=MONTH(AK9),\"\",MAX($O7:AK7)+1)","v":""},{"$f":"IF(MONTH(AM9)=MONTH(AL9),\"\",MAX($O7:AL7)+1)","v":""},{"$f":"IF(MONTH(AN9)=MONTH(AM9),\"\",MAX($O7:AM7)+1)","v":""},{"$f":"IF(MONTH(AO9)=MONTH(AN9),\"\",MAX($O7:AN7)+1)","v":7},{"$f":"IF(MONTH(AP9)=MONTH(AO9),\"\",MAX($O7:AO7)+1)","v":""},{"$f":"IF(MONTH(AQ9)=MONTH(AP9),\"\",MAX($O7:AP7)+1)","v":""},{"$f":"IF(MONTH(AR9)=MONTH(AQ9),\"\",MAX($O7:AQ7)+1)","v":""},{"$f":"IF(MONTH(AS9)=MONTH(AR9),\"\",MAX($O7:AR7)+1)","v":""},{"$f":"IF(MONTH(AT9)=MONTH(AS9),\"\",MAX($O7:AS7)+1)","v":8},{"$f":"IF(MONTH(AU9)=MONTH(AT9),\"\",MAX($O7:AT7)+1)","v":""},{"$f":"IF(MONTH(AV9)=MONTH(AU9),\"\",MAX($O7:AU7)+1)","v":""},{"$f":"IF(MONTH(AW9)=MONTH(AV9),\"\",MAX($O7:AV7)+1)","v":""},{"$f":"IF(MONTH(AX9)=MONTH(AW9),\"\",MAX($O7:AW7)+1)","v":9},{"$f":"IF(MONTH(AY9)=MONTH(AX9),\"\",MAX($O7:AX7)+1)","v":""},{"$f":"IF(MONTH(AZ9)=MONTH(AY9),\"\",MAX($O7:AY7)+1)","v":""},{"$f":"IF(MONTH(BA9)=MONTH(AZ9),\"\",MAX($O7:AZ7)+1)","v":""},{"$f":"IF(MONTH(BB9)=MONTH(BA9),\"\",MAX($O7:BA7)+1)","v":10},{"$f":"IF(MONTH(BC9)=MONTH(BB9),\"\",MAX($O7:BB7)+1)","v":""},{"$f":"IF(MONTH(BD9)=MONTH(BC9),\"\",MAX($O7:BC7)+1)","v":""},{"$f":"IF(MONTH(BE9)=MONTH(BD9),\"\",MAX($O7:BD7)+1)","v":""},{"$f":"IF(MONTH(BF9)=MONTH(BE9),\"\",MAX($O7:BE7)+1)","v":""},{"$f":"IF(MONTH(BG9)=MONTH(BF9),\"\",MAX($O7:BF7)+1)","v":11},{"$f":"IF(MONTH(BH9)=MONTH(BG9),\"\",MAX($O7:BG7)+1)","v":""},{"$f":"IF(MONTH(BI9)=MONTH(BH9),\"\",MAX($O7:BH7)+1)","v":""},{"$f":"IF(MONTH(BJ9)=MONTH(BI9),\"\",MAX($O7:BI7)+1)","v":""},{"$f":"IF(MONTH(BK9)=MONTH(BJ9),\"\",MAX($O7:BJ7)+1)","v":12},{"$f":"IF(MONTH(BL9)=MONTH(BK9),\"\",MAX($O7:BK7)+1)","v":""},{"$f":"IF(MONTH(BM9)=MONTH(BL9),\"\",MAX($O7:BL7)+1)","v":""},{"$f":"IF(MONTH(BN9)=MONTH(BM9),\"\",MAX($O7:BM7)+1)","v":""},{"$f":"IF(MONTH(BO9)=MONTH(BN9),\"\",MAX($O7:BN7)+1)","v":""}]
[null,null,"Num.","Début tâche","Fin tâche","Durée","2013-01-01","Précédente","décalage","Début tâche","Fin tâche","Durée",null,"Semaine",1,2,3,4,5,6,7,8,9,10,11,12,13,14,15,16,17,18,19,20,21,22,23,24,25,26,27,28,29,30,31,32,33,34,35,36,37,38,39,40,41,42,43,44,45,46,47,48,49,50,51,52,53]
[null,null,null,null,null,null,null,null,null,null,null,null,null,null,{"$f":"G8","v":"2013-01-01"},{"$f":"O9+7","v":"2013-01-08"},{"$f":"P9+7","v":"2013-01-15"},"2013-01-22","2013-01-29","2013-02-05","2013-02-12","2013-02-19","2013-02-26","2013-03-05","2013-03-12","2013-03-19","2013-03-26","2013-04-02","2013-04-09","2013-04-16","2013-04-23","2013-04-30","2013-05-07","2013-05-14","2013-05-21","2013-05-28","2013-06-04","2013-06-11","2013-06-18","2013-06-25","2013-07-02","2013-07-09","2013-07-16","2013-07-23","2013-07-30","2013-08-06","2013-08-13","2013-08-20","2013-08-27","2013-09-03","2013-09-10","2013-09-17","2013-09-24","2013-10-01","2013-10-08","2013-10-15","2013-10-22","2013-10-29","2013-11-05","2013-11-12","2013-11-19","2013-11-26","2013-12-03","2013-12-10","2013-12-17","2013-12-24","2013-12-31"]
[null,0,null,null,null,null,"Responsable"]
{"$rows_left_out":91}
{"sheet":"Budget","index":6,"n_rows":49,"n_cols":15,"rows_kept":49,"cut":false,"hidden":false,"merged":[[6,3,6,4],[6,6,6,7],[6,11,6,12],[4,1,4,14]]}
[]
[]
[]
[]
[null,"BUDGET"]
[]
[null,null,null,"RECETTES",null,null,"DEPENSES",null,null,null,"Date début","2013-12-10"]
[null,"INTITULE","CATEGORIES","MONTANT","DATE",null,"MONTANT","DATE"]
[null,"TOTAL",{"$f":"D9+G9","v":0},{"$f":"SUM(D10:D49)","v":0},null,null,{"$f":"SUM(G10:G49)","v":0}]
[null,null,null,null,null,{"$f":"IF(E10=\"\",\"\",YEAR(E10)+MONTH(E10)/12)","v":""},null,null,{"$f":"IF(H10=\"\",\"\",YEAR(H10)+MONTH(H10)/12)","v":""},null,"CATEGORIES","RECETTES","DEPENSES"]
{"$rows_left_out":40}
{"sheet":"Synthese","index":7,"n_rows":87,"n_cols":18,"rows_kept":87,"cut":false,"hidden":false,"merged":[]}
[]
[]
[]
[]
[]
[]
[null,"TOTAL","Nombre d'actions réalisées",null,null,"Nombre d'actions en cours",null,"Nombre d'actions non prévues",null,"Nombre totale d'actions concernées",null,null,"Nombre totale d'actions",null,null,"%  d'actions prévues réalisées",null,"%  d'actions réalisées"]
[null,"Nombre d'actions indispensables",{"$f":"COUNTIFS(Actions!K:K,\"Fait\",Actions!G:G,3)","v":0},null,null,{"$f":"COUNTIFS(Actions!K:K,\"En cours\",Actions!G:G,3)","v":0},null,{"$f":"COUNTIFS(Actions!I:I,\"Non\",Actions!G:G,3)","v":0},null,{"$f":"M8-COUNTIFS(Actions!I:I,\"NA\",Actions!G:G,3)","v":48},null,null,{"$f":"COUNTIFS(Actions!AW:AW,1,Actions!G:G,3)","v":48},null,null,{"$f":"IF((J8-H8)=0,\"\",C8/(J8-H8))","v":0},null,{"$f":"IF(J8=0,\"\",C8/J8)","v":0}]
[null,"Nombre d'actions supplémentaires",{"$f":"COUNTIFS(Actions!K:K,\"Fait\",Actions!G:G,1)+COUNTIFS(Actions!K:K,\"Fait\",Actions!G:G,2)","v":0},null,null,{"$f":"COUNTIFS(Actions!K:K,\"En cours\",Actions!G:G,1)+COUNTIFS(Actions!K:K,\"En cours\",Actions!G:G,2)","v":0},null,{"$f":"COUNTIFS(Actions!I:I,\"Non\",Actions!G:G,1)+COUNTIFS(Actions!I:I,\"Non\",Actions!G:G,2)","v":0},null,{"$f":"M9-COUNTIFS(Actions!I:I,\"NA\",Actions!G:G,1)-COUNTIFS(Actions!I:I,\"NA\",Actions!G:G,2)","v":0},null,null,{"$f":"COUNTIFS(Actions!AW:AW,1,Actions!G:G,1)+COUNTIFS(Actions!AW:AW,1,Actions!G:G,2)","v":0},null,null,{"$f":"IF((J9-H9)=0,\"\",C9/(J9-H9))","v":""},null,{"$f":"IF(J9=0,\"\",C9/J9)","v":""}]
[]
{"$rows_left_out":78}
{"sheet":"Synthese_theme","index":8,"n_rows":34,"n_cols":8,"rows_kept":34,"cut":false,"hidden":false,"merged":[]}
[]
[]
[]
[]
[]
[]
[]
[]
[null,"ANCRAGE TERRITORIAL","Nombre d'actions réalisées","Nombre d'actions en cours","Nombre d'action non prévues","Nombre totale d'action concernée","Nombre totale d'action","%  d'actions réalisées"]
[null,"Nombre d'actions indispensables",{"$f":"VLOOKUP($B9,Synthese!$B:$R,3,FALSE)","v":0},{"$f":"VLOOKUP($B9,Synthese!$B:$R,5,FALSE)","v":0},{"$f":"VLOOKUP($B9,Synthese!$B:$R,7,FALSE)","v":0},{"$f":"VLOOKUP($B9,Synthese!$B:$R,9,FALSE)","v":2},{"$f":"VLOOKUP($B9,Synthese!$B:$R,11,FALSE)","v":2},{"$f":"IF(F10=0,\"\",C10/F10)","v":0}]
{"$rows_left_out":25}
{"sheet":"Fiche","index":9,"n_rows":96,"n_cols":17,"rows_kept":96,"cut":false,"hidden":false,"merged":[[38,8,38,9],[22,3,22,4],[8,6,11,6],[8,7,11,7],[8,8,11,14],[16,3,16,4],[18,3,18,4],[20,3,20,4],[38,2,38,6]]}
[]
[]
[]
[]
[]
[]
[]
[]
[null,null,"QUALIFICATION DE L'EVENEMENT :","SCORE ATTEINT",null,null,"VOTRE SCORE TOTAL ",{"$f":"J75","v":3.3333333333333333E-2},{"$f":"IF(H9>80%,C12,IF(H9>60%,C11,IF(H9>40%,C10,\"A améliorer\")))","v":"A améliorer"}]
[null,null,"EVENEMENT RESPECTUEUX","40 à 60 %"]
{"$rows_left_out":87}
{"sheet":"Ton_avis","index":10,"n_rows":10,"n_cols":2,"rows_kept":10,"cut":false,"hidden":false,"merged":[[6,1,6,14],[9,1,11,14]]}
[]
[]
[]
[]
[]
[]
[null,"TON AVIS"]
[]
[]
[null,"Cet outil a vocation à évoluer avec le temps. Nous avons besoin de ton retour d'expérience pour l'améliorer. \nSi tu souhaites également nous soumettre des actions ou des exemples issus de ta propre expérience, nous pourrons les introduire dans la prochaine version de l'outil."]
{"$rows_left_out":1}
{"sheet":"Glossaire","index":11,"n_rows":134,"n_cols":4,"rows_kept":134,"cut":false,"hidden":false,"merged":[[115,1,115,2],[115,3,115,14],[117,1,117,2],[117,3,117,14],[119,1,119,2],[119,3,119,14],[73,3,73,14],[73,1,73,2],[111,1,111,2],[111,3,111,14],[113,1,113,2],[113,3,113,14],[79,3,79,14],[79,1,79,2],[77,3,77,14],[77,1,77,2],[75,3,75,14],[75,1,75,2],[85,3,85,14],[85,1,85,2],[83,3,83,14],[83,1,83,2],[81,3,81,14],[81,1,81,2],[133,1,133,2],[133,3,133,14],[127,1,127,2],[127,3,127,14],[129,1,129,2],[129,3,129,14],[131,1,131,2],[131,3,131,14],[121,1,121,2],[121,3,121,14],[123,1,123,2],[123,3,123,14],[125,1,125,2],[125,3,125,14],[91,3,91,14],[91,1,91,2],[89,3,89,14],[89,1,89,2],[87,3,87,14],[87,1,87,2],[97,3,97,14],[97,1,97,2],[95,3,95,14],[95,1,95,2],[93,3,93,14],[93,1,93,2],[103,3,103,14],[103,1,103,2],[101,3,101,14],[101,1,101,2],[99,3,99,14],[99,1,99,2],[109,3,109,14],[109,1,109,2],[107,3,107,14],[107,1,107,2],[105,3,105,14],[105,1,105,2],[13,1,13,2],[13,3,13,14],[6,1,6,14],[9,1,9,2],[9,3,9,14],[11,1,11,2],[11,3,11,14],[15,1,15,2],[15,3,15,14],[17,1,17,2],[17,3,17,14],[19,1,19,2],[19,3,19,14],[21,1,21,2],[21,3,21,14],[23,1,23,2],[23,3,23,14],[25,1,25,2],[25,3,25,14],[27,1,27,2],[27,3,27,14],[29,1,29,2],[29,3,29,14],[31,1,31,2],[31,3,31,14],[35,1,35,2],[35,3,35,14],[33,1,33,14],[37,1,37,2],[37,3,37,14],[39,1,39,2],[39,3,39,14],[41,1,41,2],[41,3,41,14],[43,1,43,2],[43,3,43,14],[45,1,45,2],[45,3,45,14],[47,1,47,2],[47,3,47,14],[49,1,49,2],[49,3,49,14],[51,1,51,2],[51,3,51,14],[53,1,53,2],[53,3,53,14],[55,1,55,2],[55,3,55,14],[57,1,57,2],[57,3,57,14],[59,1,59,2],[59,3,59,14],[61,1,61,2],[61,3,61,14],[69,1,69,2],[69,3,69,14],[71,1,71,2],[71,3,71,14],[63,1,63,2],[63,3,63,14],[65,1,65,2],[65,3,65,14],[67,1,67,2],[67,3,67,14]]}
[]
[]
[]
[]
[]
[]
[null,"GLOSSAIRE"]
[]
[]
[null,"ANCRAGE TERRITORIAL",null,"L’ancrage territorial désigne la capacité de l’événement à contribuer au développement local des territoires qu’il touche, dans une perspective de développement durable et de responsabilité sociétale.\nL’organisation d’un événement sur un territoire doit donc mettre en place de bonnes pratiques en prenant en compte différents champs d’intervention : le dialogue avec les communautés locales, le développement économique des territoires, la gestion des mutations économiques, le développement social local,...\nPour être dans une démarche d’ancrage territorial, il faut donc établir une cohérence forte entre l’organisation d’un événement et son environnement géographique, politique, social, économique."]
{"$rows_left_out":125}
{"sheet":"Credits","index":12,"n_rows":0,"n_cols":0,"rows_kept":0,"cut":false,"hidden":false,"merged":[[5,3,5,10],[7,3,7,10],[22,3,22,10],[10,8,12,10],[14,8,19,10]]}

{"sheet":"Paramètres","index":13,"n_rows":182,"n_cols":12,"rows_kept":182,"cut":false,"hidden":false,"merged":[]}
["Viande","kgeqC / T",null,null,"oui"]
["Agneau",3832,null,null,"non"]
["Bœuf",4744]
["Canard",577]
["Cochon",1217]
["Dinde (fermière)",808]
["Dinde (industrielle)",449]
["Mouton",3832]
["Œuf",3476]
["Poisson (moyenne française)",440]
{"$rows_left_out":173}
{"sheet":"Feuil2","index":14,"n_rows":14,"n_cols":1,"rows_kept":14,"cut":false,"hidden":false,"merged":[]}
[]
["THÈMATIQUES"]
["Ancrage territorial"]
["Biodiversité"]
["Culture"]
["Economie"]
["Empreinte carbone"]
["Equité"]
["gestion des ressources"]
["Gouvernance"]
{"$rows_left_out":4}